Reaction Details
TargetMuscarinic acetylcholine receptor M3
LigandBDBM50064176
Substrate/Competitorn/a
Ki 1096.48±n/a nM
CommentsPDSP_6
Citation Melchiorre, CBolognesi, MLChiarini, AMinarini, ASpampinato, S Synthesis and biological activity of some methoctramine-related tetraamines bearing a 11-acetyl-5,11-dihydro-6H-pyrido[2,3-b][1,4]-benzodiazepin-6-one moiety as antimuscarinics: a second generation of highly selective M2 muscarinic receptor antagonists. J Med Chem36:3734-7 (1993) 
 
Muscarinic acetylcholine receptor M3
Name:Muscarinic acetylcholine receptor M3
Type:Enzyme Catalytic Domain
Mol. Mass.:66086.66
Organism:RAT
Description:Cholinergic, muscarinic M3 CHRM3 RAT::P08483
Residue:589
BDBM50064176
NameBDBM50064176
Synonyms:CHEMBL27673 METHOCTRAMINE N1,N8-bis(6-(2-methoxybenzylamino)hexyl)octane-1,8-diamine
TypeSmall organic molecule
Emp. Form.C36H62N4O2
Mol. Mass.582.9031
SMILESCOc1ccccc1CNCCCCCCNCCCCCCCCNCCCCCCNCc1ccccc1OC