Reaction Details
TargetD(2) dopamine receptor
LigandBDBM35256
Substrate/Competitorn/a
Ki 1700±n/a nM
CommentsPDSP_1235
Citation Kessler, RMVotaw, JRde Paulis, TBingham, DRAnsari, MSMason, NSHolburn, GSchmidt, DEVotaw, DBManning, RG Evaluation of 5-[18F]fluoropropylepidepride as a potential PET radioligand for imaging dopamine D2 receptors. Synapse15:169-76 (1993) 
 
D(2) dopamine receptor
Name:D(2) dopamine receptor
Type:G Protein-Coupled Receptor (GPCR)
Mol. Mass.:50931.60
Organism:Rattus norvegicus (rat)
Description:P61169
Residue:444
BDBM35256
NameBDBM35256
Synonyms:(S)-mianserin MIANSERIN MIANSERIN (-) | Tolvon
TypeSmall organic molecule
Emp. Form.C18H20N2
Mol. Mass.264.3648
SMILES[H][C@]12CN(C)CCN1c1ccccc1Cc1ccccc21