Reaction Details
TargetD(2) dopamine receptor
LigandBDBM29568
Substrate/Competitorn/a
Ki>10000±n/a nM
CommentsPDSP_1528
Citation Kessler, RMVotaw, JRde Paulis, TBingham, DRAnsari, MSMason, NSHolburn, GSchmidt, DEVotaw, DBManning, RG Evaluation of 5-[18F]fluoropropylepidepride as a potential PET radioligand for imaging dopamine D2 receptors. Synapse15:169-76 (1993) 
 
D(2) dopamine receptor
Name:D(2) dopamine receptor
Type:G Protein-Coupled Receptor (GPCR)
Mol. Mass.:50931.60
Organism:Rattus norvegicus (rat)
Description:P61169
Residue:444
BDBM29568
NameBDBM29568
Synonyms:CHEMBL2 PRAZOSIN HYDROCHLORIDE [3H]-Minipress [3H]-Prazosin
Typeradiolabeled ligand
Emp. Form.C19H21N5O4
Mol. Mass.383.4011
SMILESCOc1cc2nc(nc(N)c2cc1OC)N1CCN(CC1)C(=O)c1ccco1