Reaction Details
Target5-hydroxytryptamine receptor 3A
LigandBDBM82563
Substrate/Competitorn/a
Ki 53.7±n/a nM
CommentsPDSP_1656
Citation Millan, MJCanton, HGobert, ALejeune, FRivet, JMBervoets, KBrocco, MWiddowson, PMennini, TAudinot, V Novel benzodioxopiperazines acting as antagonists at postsynaptic 5-HT1A receptors and as agonists at 5-HT1A autoreceptors: a comparative pharmacological characterization with proposed 5-HT1A antagonists. J Pharmacol Exp Ther268:337-52 (1994) 5-hydroxytryptamine receptor 3A
Name:5-hydroxytryptamine receptor 3A
Type:Enzyme Catalytic Domain
Mol. Mass.:55428.70
Organism:RAT
Description:5-HT3 HTR3A RAT::P35563
Residue:483
BDBM82563
NameBDBM82563
Synonyms:CAS_182596 S 15931
TypeSmall organic molecule
Emp. Form.C23H28N2O2
Mol. Mass.364.4806
SMILESC(CN1CCN(CC1)c1cccc2OCCOc12)C1CCc2ccccc12