Reaction Details
TargetD(2) dopamine receptor
LigandBDBM50010289
Substrate/Competitorn/a
Ki 5.9±n/a nM
CommentsPDSP_1268
Citation Freedman, SBPatel, SMarwood, REmms, FSeabrook, GRKnowles, MRMcAllister, G Expression and pharmacological characterization of the human D3 dopamine receptor. J Pharmacol Exp Ther268:417-26 (1994) D(2) dopamine receptor
Name:D(2) dopamine receptor
Type:Cell-surface receptors
Mol. Mass.:50647.10
Organism:Homo sapiens (Human)
Description:P14416
Residue:443
BDBM50010289
NameBDBM50010289
Synonyms:(R)6-(Phenethyl-propyl-amino)-5,6,7,8-tetrahydro-naphthalen-1-ol (S)6-(Phenethyl-propyl-amino)-5,6,7,8-tetrahydro-naphthalen-1-ol CHEMBL109684 | N-0434
TypeSmall organic molecule
Emp. Form.C21H27NO
Mol. Mass.309.4452
SMILESCCCN(CCc1ccccc1)C1CCc2c(O)cccc2C1