Reaction Details
TargetD(2) dopamine receptor
LigandBDBM82569
Substrate/Competitorn/a
Ki 0.12±n/a nM
CommentsPDSP_1582
Citation Freedman, SBPatel, SMarwood, REmms, FSeabrook, GRKnowles, MRMcAllister, G Expression and pharmacological characterization of the human D3 dopamine receptor. J Pharmacol Exp Ther268:417-26 (1994) D(2) dopamine receptor
Name:D(2) dopamine receptor
Type:Cell-surface receptors
Mol. Mass.:50647.10
Organism:Homo sapiens (Human)
Description:P14416
Residue:443
BDBM82569
NameBDBM82569
Synonyms:CAS_18426-20-5 R(-)NPA
TypeSmall organic molecule
Emp. Form.C19H20FNO2
Mol. Mass.313.366
SMILESCCCN1CCc2cc(F)cc-3c2C1Cc1ccc(O)c(O)c-31