Reaction Details
TargetD(3) dopamine receptor
LigandBDBM82567
Substrate/Competitorn/a
Ki 1.5±n/a nM
CommentsPDSP_243
Citation Freedman, SBPatel, SMarwood, REmms, FSeabrook, GRKnowles, MRMcAllister, G Expression and pharmacological characterization of the human D3 dopamine receptor. J Pharmacol Exp Ther268:417-26 (1994) D(3) dopamine receptor
Name:D(3) dopamine receptor
Type:n/a
Mol. Mass.:44243.43
Organism:Homo sapiens (Human)
Description:n/a
Residue:400
BDBM82567
NameBDBM82567
Synonyms:ADTN DIMETHYL 6,7
Typen/a
Emp. Form.C12H17N
Mol. Mass.175.2701
SMILESCc1ccc2CCC(N)Cc2c1C