Reaction Details
TargetD(3) dopamine receptor
LigandBDBM50010289
Substrate/Competitorn/a
Ki 0.26±n/a nM
CommentsPDSP_1268
Citation Freedman, SBPatel, SMarwood, REmms, FSeabrook, GRKnowles, MRMcAllister, G Expression and pharmacological characterization of the human D3 dopamine receptor. J Pharmacol Exp Ther268:417-26 (1994) D(3) dopamine receptor
Name:D(3) dopamine receptor
Type:n/a
Mol. Mass.:44243.43
Organism:Homo sapiens (Human)
Description:n/a
Residue:400
BDBM50010289
NameBDBM50010289
Synonyms:(R)6-(Phenethyl-propyl-amino)-5,6,7,8-tetrahydro-naphthalen-1-ol (S)6-(Phenethyl-propyl-amino)-5,6,7,8-tetrahydro-naphthalen-1-ol CHEMBL109684 | N-0434
TypeSmall organic molecule
Emp. Form.C21H27NO
Mol. Mass.309.4452
SMILESCCCN(CCc1ccccc1)C1CCc2c(O)cccc2C1