Reaction Details
TargetD(3) dopamine receptor
LigandBDBM82569
Substrate/Competitorn/a
Ki 0.21±n/a nM
CommentsPDSP_1582
Citation Freedman, SBPatel, SMarwood, REmms, FSeabrook, GRKnowles, MRMcAllister, G Expression and pharmacological characterization of the human D3 dopamine receptor. J Pharmacol Exp Ther268:417-26 (1994) D(3) dopamine receptor
Name:D(3) dopamine receptor
Type:n/a
Mol. Mass.:44243.43
Organism:Homo sapiens (Human)
Description:n/a
Residue:400
BDBM82569
NameBDBM82569
Synonyms:CAS_18426-20-5 R(-)NPA
TypeSmall organic molecule
Emp. Form.C19H20FNO2
Mol. Mass.313.366
SMILESCCCN1CCc2cc(F)cc-3c2C1Cc1ccc(O)c(O)c-31