Reaction Details
TargetGlucose-6-phosphate dehydrogenase-6-phosphogluconolactonase
LigandBDBM81065
Substrate/Competitorn/a
Meas. Tech.Dose Response orthogonal assay utilizing the direct end-point detection of NADPH for uHTS small molecule inhibitors of Plasmodium falciparum Glucose-6-phosphate dehydrogenase
IC50>80000±n/a nM
Citation PubChem, PC Dose Response orthogonal assay utilizing the direct end-point detection of NADPH for uHTS small molecule inhibitors of Plasmodium falciparum Glucose-6-phosphate dehydrogenase PubChem Bioassay(2011)[AID]
 
Glucose-6-phosphate dehydrogenase-6-phosphogluconolactonase
Name:Glucose-6-phosphate dehydrogenase-6-phosphogluconolactonase
Synonyms:n/a
Type:Enzyme Catalytic Domain
Mol. Mass.:109731.64
Organism:Plasmodium falciparum 3D7
Description:gi_12381848
Residue:950
BDBM81065
NameBDBM81065
TypeSmall organic molecule
Emp. Form.C17H16ClN3O2
Mol. Mass.329.781
SMILESClc1ccccc1NC(=O)CCC(=O)NN=Cc1ccccc1