Reaction Details
TargetGlucose-6-phosphate dehydrogenase-6-phosphogluconolactonase
LigandBDBM34452
Substrate/Competitorn/a
Meas. Tech.Dose Response orthogonal kinetic assay utilizing the direct detection of NADPH for uHTS small molecule inhibitors of Plasmodium falciparum Glucose-6-phosphate dehydrogenase
IC50 50300±n/a nM
Citation PubChem, PC Dose Response orthogonal kinetic assay utilizing the direct detection of NADPH for uHTS small molecule inhibitors of Plasmodium falciparum Glucose-6-phosphate dehydrogenase PubChem Bioassay(2011)[AID]
 
Glucose-6-phosphate dehydrogenase-6-phosphogluconolactonase
Name:Glucose-6-phosphate dehydrogenase-6-phosphogluconolactonase
Synonyms:n/a
Type:Enzyme Catalytic Domain
Mol. Mass.:109731.64
Organism:Plasmodium falciparum 3D7
Description:gi_12381848
Residue:950
BDBM34452
NameBDBM34452
TypeSmall organic molecule
Emp. Form.C15H18N4OS2
Mol. Mass.334.46
SMILESCN1CCN(CC1)C(=O)c1sc(=S)n(c1N)-c1ccccc1