Reaction Details
TargetGlucose-6-phosphate dehydrogenase-6-phosphogluconolactonase
LigandBDBM33066
Substrate/Competitorn/a
Meas. Tech.Dose Response orthogonal kinetic assay utilizing the direct detection of NADPH for uHTS small molecule inhibitors of Plasmodium falciparum Glucose-6-phosphate dehydrogenase
IC50 35600±n/a nM
Citation PubChem, PC Dose Response orthogonal kinetic assay utilizing the direct detection of NADPH for uHTS small molecule inhibitors of Plasmodium falciparum Glucose-6-phosphate dehydrogenase PubChem Bioassay(2011)[AID]
 
Glucose-6-phosphate dehydrogenase-6-phosphogluconolactonase
Name:Glucose-6-phosphate dehydrogenase-6-phosphogluconolactonase
Synonyms:n/a
Type:Enzyme Catalytic Domain
Mol. Mass.:109731.64
Organism:Plasmodium falciparum 3D7
Description:gi_12381848
Residue:950
BDBM33066
NameBDBM33066
TypeSmall organic molecule
Emp. Form.C15H15Cl2N3O2S
Mol. Mass.372.27
SMILESCN(C)c1ncc(s1)C1=C(Cl)C(=O)C(N2CCCC2)=C(Cl)C1=O