Reaction Details
TargetCarboxy-terminal domain RNA polymerase II polypeptide A small phosphatase 1
LigandBDBM54768
Substrate/Competitorn/a
Meas. Tech.Dose Response confirmation of uHTS hits for Scp-1 phosphatase using a colorimetric assay
IC50 453±23 nM
Citation PubChem, PC Dose Response confirmation of uHTS hits for Scp-1 phosphatase using a colorimetric assay PubChem Bioassay(2011)[AID]
 
Carboxy-terminal domain RNA polymerase II polypeptide A small phosphatase 1
Name:Carboxy-terminal domain RNA polymerase II polypeptide A small phosphatase 1
Type:Enzyme Catalytic Domain
Mol. Mass.:29199.89
Organism:Homo sapiens (Human)
Description:gi_10864009
Residue:261
BDBM54768
NameBDBM54768
Synonyms:2-[3-[2-hydroxyethyl(dimethyl)ammonio]propanoylamino]-2-methyl-propane-1-sulfonate 2-[3-[2-hydroxyethyl(dimethyl)azaniumyl]propanoylamino]-2-methylpropane-1-sulfonate MLS000554255 US20230364057, Compound 42 | cid_1973720
TypeSmall organic molecule
Emp. Form.C11H24N2O5S
Mol. Mass.296.384
SMILESCC(C)(CS([O-])(=O)=O)NC(=O)CC[N+](C)(C)CCO