Reaction Details
TargetCarboxy-terminal domain RNA polymerase II polypeptide A small phosphatase 1
LigandBDBM55549
Substrate/Competitorn/a
Meas. Tech.Dose Response confirmation of uHTS hits for Scp-1 phosphatase using a colorimetric assay
IC50 1988±104 nM
Citation PubChem, PC Dose Response confirmation of uHTS hits for Scp-1 phosphatase using a colorimetric assay PubChem Bioassay(2011)[AID]
 
Carboxy-terminal domain RNA polymerase II polypeptide A small phosphatase 1
Name:Carboxy-terminal domain RNA polymerase II polypeptide A small phosphatase 1
Type:Enzyme Catalytic Domain
Mol. Mass.:29199.89
Organism:Homo sapiens (Human)
Description:gi_10864009
Residue:261
BDBM55549
NameBDBM55549
Synonyms:2-hydroxy-N-[(Z)-[1-[2-(3-methylanilino)-2-oxoethyl]-2-oxo-3-indolylidene]amino]benzamide 2-hydroxy-N-[(Z)-[2-keto-1-[2-keto-2-(m-toluidino)ethyl]indolin-3-ylidene]amino]benzamide MLS000548432 SMR000171366 | cid_6870326
TypeSmall organic molecule
Emp. Form.C24H20N4O4
Mol. Mass.428.44
SMILESCc1cccc(NC(=O)CN2C(=O)\C(=N/NC(=O)c3ccccc3O)c3ccccc23)c1