Reaction Details
TargetCarboxy-terminal domain RNA polymerase II polypeptide A small phosphatase 1
LigandBDBM54975
Substrate/Competitorn/a
Meas. Tech.Dose Response confirmation of uHTS hits for Scp-1 phosphatase using a colorimetric assay
IC50 3747±269 nM
Citation PubChem, PC Dose Response confirmation of uHTS hits for Scp-1 phosphatase using a colorimetric assay PubChem Bioassay(2011)[AID]
 
Carboxy-terminal domain RNA polymerase II polypeptide A small phosphatase 1
Name:Carboxy-terminal domain RNA polymerase II polypeptide A small phosphatase 1
Type:Enzyme Catalytic Domain
Mol. Mass.:29199.89
Organism:Homo sapiens (Human)
Description:gi_10864009
Residue:261
BDBM54975
NameBDBM54975
Synonyms:MLS000394231 N-(4-methoxy-3-morpholin-4-ylsulfonylphenyl)-2,3-dihydro-1H-cyclopenta[b]quinoline-9-carboxamide N-[4-methoxy-3-(4-morpholinylsulfonyl)phenyl]-2,3-dihydro-1H-cyclopenta[b]quinoline-9-carboxamide cid_4840580
TypeSmall organic molecule
Emp. Form.C24H25N3O5S
Mol. Mass.467.537
SMILESCOc1ccc(NC(=O)c2c3CCCc3nc3ccccc23)cc1S(=O)(=O)N1CCOCC1