Reaction Details
TargetCarboxy-terminal domain RNA polymerase II polypeptide A small phosphatase 1
LigandBDBM52017
Substrate/Competitorn/a
Meas. Tech.Dose Response confirmation of uHTS hits for Scp-1 phosphatase using a colorimetric assay
IC50 1544±64 nM
Citation PubChem, PC Dose Response confirmation of uHTS hits for Scp-1 phosphatase using a colorimetric assay PubChem Bioassay(2011)[AID]
 
Carboxy-terminal domain RNA polymerase II polypeptide A small phosphatase 1
Name:Carboxy-terminal domain RNA polymerase II polypeptide A small phosphatase 1
Type:Enzyme Catalytic Domain
Mol. Mass.:29199.89
Organism:Homo sapiens (Human)
Description:gi_10864009
Residue:261
BDBM52017
NameBDBM52017
Synonyms:2,6-Dibromo-4-[(3-mercapto-5-phenyl-[1,2,4]triazol-4-ylimino)-methyl]-phenol 2,6-dibromo-4-[[(3-phenyl-5-sulfanylidene-1H-1,2,4-triazol-4-yl)amino]methylidene]-1-cyclohexa-2,5-dienone 2,6-dibromo-4-[[(3-phenyl-5-thioxo-1H-1,2,4-triazol-4-yl)amino]methylene]cyclohexa-2,5-dien-1-one SMR000513433 | cid_5753333
TypeSmall organic molecule
Emp. Form.C15H10Br2N4OS
Mol. Mass.454.139
SMILESOc1c(Br)cc(C=Nn2c(n[nH]c2=S)-c2ccccc2)cc1Br