Reaction Details
TargetCarboxy-terminal domain RNA polymerase II polypeptide A small phosphatase 1
LigandBDBM83003
Substrate/Competitorn/a
Meas. Tech.Dose Response confirmation of uHTS hits for Scp-1 phosphatase using a colorimetric assay
IC50 3151±415 nM
Citation PubChem, PC Dose Response confirmation of uHTS hits for Scp-1 phosphatase using a colorimetric assay PubChem Bioassay(2011)[AID]
 
Carboxy-terminal domain RNA polymerase II polypeptide A small phosphatase 1
Name:Carboxy-terminal domain RNA polymerase II polypeptide A small phosphatase 1
Type:Enzyme Catalytic Domain
Mol. Mass.:29199.89
Organism:Homo sapiens (Human)
Description:gi_10864009
Residue:261
BDBM83003
NameBDBM83003
Synonyms:(6E)-5-azanylidene-6-[[3-methoxy-4-[2-(4-methylphenoxy)ethoxy]phenyl]methylidene]-2-methylsulfonyl-[1,3,4]thiadiazolo[3,2-a]pyrimidin-7-one (6E)-5-imino-6-[[3-methoxy-4-[2-(4-methylphenoxy)ethoxy]phenyl]methylidene]-2-methylsulfonyl-[1,3,4]thiadiazolo[3,2-a]pyrimidin-7-one MLS001199626 cid_24792310
TypeSmall organic molecule
Emp. Form.C23H22N4O6S2
Mol. Mass.514.574
SMILESCOc1cc(C=C2C(=O)N=C3SC(=NN3C2=N)S(C)(=O)=O)ccc1OCCOc1ccc(C)cc1