Reaction Details
TargetCarboxy-terminal domain RNA polymerase II polypeptide A small phosphatase 1
LigandBDBM79514
Substrate/Competitorn/a
Meas. Tech.Dose Response confirmation of uHTS hits for Scp-1 phosphatase using a colorimetric assay
IC50 1889±174 nM
Citation PubChem, PC Dose Response confirmation of uHTS hits for Scp-1 phosphatase using a colorimetric assay PubChem Bioassay(2011)[AID]
 
Carboxy-terminal domain RNA polymerase II polypeptide A small phosphatase 1
Name:Carboxy-terminal domain RNA polymerase II polypeptide A small phosphatase 1
Type:Enzyme Catalytic Domain
Mol. Mass.:29199.89
Organism:Homo sapiens (Human)
Description:gi_10864009
Residue:261
BDBM79514
NameBDBM79514
Synonyms:Erythrosin B SMR000875321 cid_25162930 sodium;2-(2,4,5,7-tetraiodo-3-oxido-6-oxo-9-xanthenyl)benzoate sodium;2-[2,4,5,7-tetrakis(iodanyl)-3-oxidanidyl-6-oxidanylidene-xanthen-9-yl]benzoate
TypeSmall organic molecule
Emp. Form.C20H6I4O5
Mol. Mass.833.8776
SMILES[O-]C(=O)c1ccccc1-c1c2cc(I)c([O-])c(I)c2oc2c(I)c(=O)c(I)cc12