Reaction Details
TargetCarboxy-terminal domain RNA polymerase II polypeptide A small phosphatase 1
LigandBDBM20283
Substrate/Competitorn/a
Meas. Tech.Dose Response confirmation of uHTS hits for Scp-1 phosphatase using a colorimetric assay
IC50 4636±719 nM
Citation PubChem, PC Dose Response confirmation of uHTS hits for Scp-1 phosphatase using a colorimetric assay PubChem Bioassay(2011)[AID]
 
Carboxy-terminal domain RNA polymerase II polypeptide A small phosphatase 1
Name:Carboxy-terminal domain RNA polymerase II polypeptide A small phosphatase 1
Type:Enzyme Catalytic Domain
Mol. Mass.:29199.89
Organism:Homo sapiens (Human)
Description:gi_10864009
Residue:261
BDBM20283
NameBDBM20283
Synonyms:2-hydroxy-4-(2-{[(4-methylbenzene)sulfonyl]oxy}acetamido)benzoic acid S3I-201 | cid_252682
TypeSmall organic molecule
Emp. Form.C16H15NO7S
Mol. Mass.365.358
SMILESCc1ccc(cc1)S(=O)(=O)OCC(=O)Nc1ccc(C(O)=O)c(O)c1