Reaction Details
TargetC-C chemokine receptor type 6
LigandBDBM60214
Substrate/Competitorn/a
Meas. Tech.SAR analysis of small molecule antagonists of the CCR6 receptor: a luminescent beta-arrestin assay
IC50 11000±n/a nM
Citation PubChem, PC SAR analysis of small molecule antagonists of the CCR6 receptor: a luminescent beta-arrestin assay PubChem Bioassay(2011)[AID]
 
C-C chemokine receptor type 6
Name:C-C chemokine receptor type 6
Type:Enzyme
Mol. Mass.:42510.84
Organism:Homo sapiens (Human)
Description:P51684
Residue:374
BDBM60214
NameBDBM60214
Synonyms:4-chloranyl-N-(5-phenyl-1,3,4-oxadiazol-2-yl)benzamide MLS000057767 cid_805087
TypeSmall organic molecule
Emp. Form.C15H10ClN3O2
Mol. Mass.299.712
SMILESClc1ccc(cc1)C(=O)Nc1nnc(o1)-c1ccccc1