Reaction Details
TargetC-C chemokine receptor type 6
LigandBDBM80006
Substrate/Competitorn/a
Meas. Tech.SAR analysis of small molecule antagonists of the CCR6 receptor: a luminescent beta-arrestin assay
IC50 9410±n/a nM
Citation PubChem, PC SAR analysis of small molecule antagonists of the CCR6 receptor: a luminescent beta-arrestin assay PubChem Bioassay(2011)[AID]
 
C-C chemokine receptor type 6
Name:C-C chemokine receptor type 6
Type:Enzyme
Mol. Mass.:42510.84
Organism:Homo sapiens (Human)
Description:P51684
Residue:374
BDBM80006
NameBDBM80006
Synonyms:2,5-diphenyl-N'-(phenylcarbonyl)pyrazole-3-carbohydrazide N'-benzoyl-2,5-diphenyl-3-pyrazolecarbohydrazide N'-benzoyl-2,5-diphenylpyrazole-3-carbohydrazide cid_4883406
TypeSmall organic molecule
Emp. Form.C23H18N4O2
Mol. Mass.382.4146
SMILESO=C(NNC(=O)c1ccccc1)c1cc(nn1-c1ccccc1)-c1ccccc1