Reaction Details
TargetC-C chemokine receptor type 6
LigandBDBM54428
Substrate/Competitorn/a
Meas. Tech.SAR analysis of small molecule antagonists of the CCR6 receptor: a luminescent beta-arrestin assay
IC50 10400±n/a nM
Citation PubChem, PC SAR analysis of small molecule antagonists of the CCR6 receptor: a luminescent beta-arrestin assay PubChem Bioassay(2011)[AID]
 
C-C chemokine receptor type 6
Name:C-C chemokine receptor type 6
Type:Enzyme
Mol. Mass.:42510.84
Organism:Homo sapiens (Human)
Description:P51684
Residue:374
BDBM54428
NameBDBM54428
Synonyms:2-(4-methylphenyl)sulfonyl-5-nitro-pyridine 4-methylphenyl 5-nitro-2-pyridinyl sulfone MLS001165624 cid_1472329
TypeSmall organic molecule
Emp. Form.C12H10N2O4S
Mol. Mass.278.284
SMILESCc1ccc(cc1)S(=O)(=O)c1ccc(cn1)[N+]([O-])=O