Reaction Details
TargetC-C chemokine receptor type 6
LigandBDBM72680
Substrate/Competitorn/a
Meas. Tech.SAR analysis of small molecule antagonists of the CCR6 receptor: a luminescent beta-arrestin assay
IC50 5840±n/a nM
Citation PubChem, PC SAR analysis of small molecule antagonists of the CCR6 receptor: a luminescent beta-arrestin assay PubChem Bioassay(2011)[AID]
 
C-C chemokine receptor type 6
Name:C-C chemokine receptor type 6
Type:Enzyme
Mol. Mass.:42510.84
Organism:Homo sapiens (Human)
Description:P51684
Residue:374
BDBM72680
NameBDBM72680
Synonyms:5-[5-(4-Chloro-phenyl)-pyrazolidin-3-ylidene]-1,3-dimethyl-pyrimidine-2,4,6-trione 5-[5-(4-chlorophenyl)pyrazolidin-3-ylidene]-1,3-dimethyl-1,3-diazinane-2,4,6-trione MLS000762999 cid_6224486
TypeSmall organic molecule
Emp. Form.C15H15ClN4O3
Mol. Mass.334.758
SMILESCN1C(=O)C(C2CC(N=N2)c2ccc(Cl)cc2)C(=O)N(C)C1=O