Reaction Details
TargetPhospholipase A2
LigandBDBM31751
Substrate/Competitorn/a
Meas. Tech.Dose response counterscreen of uHTS hits for ATG4B inhibitors in a Phospholipase A2 assay
IC50 7530±n/a nM
Citation PubChem, PC Dose response counterscreen of uHTS hits for ATG4B inhibitors in a Phospholipase A2 assay PubChem Bioassay(2011)[AID]
 
Phospholipase A2
Name:Phospholipase A2
Type:Protein
Mol. Mass.:16364.13
Organism:Homo sapiens (Human)
Description:P04054
Residue:148
BDBM31751
NameBDBM31751
Synonyms:3-[(2-chlorobenzyl)thio]-5,6-bis(2-furyl)-1,2,4-triazine 3-[(2-chlorophenyl)methylthio]-5,6-bis(2-furanyl)-1,2,4-triazine cid_6400942
TypeSmall organic molecule
Emp. Form.C18H12ClN3O2S
Mol. Mass.369.825
SMILESClc1ccccc1CSc1nnc(-c2ccco2)c(n1)-c1ccco1