Reaction Details
TargetPhospholipase A2
LigandBDBM80075
Substrate/Competitorn/a
Meas. Tech.Dose response counterscreen of uHTS hits for ATG4B inhibitors in a Phospholipase A2 assay
IC50>80000±n/a nM
Citation PubChem, PC Dose response counterscreen of uHTS hits for ATG4B inhibitors in a Phospholipase A2 assay PubChem Bioassay(2011)[AID]
 
Phospholipase A2
Name:Phospholipase A2
Type:Protein
Mol. Mass.:16364.13
Organism:Homo sapiens (Human)
Description:P04054
Residue:148
BDBM80075
NameBDBM80075
Synonyms:7-bromanyl-6-methoxy-quinoline-5,8-dione 7-bromo-6-methoxyquinoline-5,8-dione SMR001570458 | cid_265935
TypeSmall organic molecule
Emp. Form.C10H6BrNO3
Mol. Mass.268.064
SMILESCOC1=C(Br)C(=O)c2ncccc2C1=O