Reaction Details
TargetEndoribonuclease toxin MazF
LigandBDBM34565
Substrate/Competitorn/a
Meas. Tech.Dose response confirmation uHTS hits for MazEF TA System activators via a fluorescence-based single-stranded RNase assay
EC50>99000±n/a nM
Citation PubChem, PC Dose response confirmation uHTS hits for MazEF TA System activators via a fluorescence-based single-stranded RNase assay PubChem Bioassay(2011)[AID]
 
Endoribonuclease toxin MazF
Name:Endoribonuclease toxin MazF
Type:Enzyme Catalytic Domain
Mol. Mass.:12100.43
Organism:Escherichia coli str. K-12 substr. MG1655
Description:gi_16130689
Residue:111
BDBM34565
NameBDBM34565
Synonyms:6-Amino-4-(4-hydroxy-3,5-dimethoxy-phenyl)-3-methoxymethyl-2,4-dihydro-pyrano[2,3-c]pyrazole-5-carbonitrile 6-amino-4-(4-hydroxy-3,5-dimethoxyphenyl)-3-(methoxymethyl)-2,4-dihydropyrano[2,3-c]pyrazole-5-carbonitrile MLS000033666 cid_647209
TypeSmall organic molecule
Emp. Form.C17H18N4O5
Mol. Mass.358.3486
SMILESCOCc1n[nH]c2OC(=N)C(C#N)C(c12)c1cc(OC)c(O)c(OC)c1