Reaction Details
TargetEndoribonuclease toxin MazF
LigandBDBM83467
Substrate/Competitorn/a
Meas. Tech.Dose response confirmation uHTS hits for MazEF TA System activators via a fluorescence-based single-stranded RNase assay
EC50>99000±n/a nM
Citation PubChem, PC Dose response confirmation uHTS hits for MazEF TA System activators via a fluorescence-based single-stranded RNase assay PubChem Bioassay(2011)[AID]
 
Endoribonuclease toxin MazF
Name:Endoribonuclease toxin MazF
Type:Enzyme Catalytic Domain
Mol. Mass.:12100.43
Organism:Escherichia coli str. K-12 substr. MG1655
Description:gi_16130689
Residue:111
BDBM83467
NameBDBM83467
Synonyms:(3-Cyano-5,7-dimethyl-quinolin-2-ylsulfanyl)-acetic acid methyl ester 2-[(3-cyano-5,7-dimethyl-2-quinolyl)thio]acetic acid methyl ester SMR000005252 methyl 2-(3-cyano-5,7-dimethyl-quinolin-2-yl)sulfanylethanoate | methyl 2-(3-cyano-5,7-dimethylquinolin-2-yl)sulfanylacetate
TypeSmall organic molecule
Emp. Form.C15H14N2O2S
Mol. Mass.286.349
SMILESCOC(=O)CSc1nc2cc(C)cc(C)c2cc1C#N