Reaction Details
TargetEndoribonuclease toxin MazF
LigandBDBM31009
Substrate/Competitorn/a
Meas. Tech.Dose response confirmation uHTS hits for MazEF TA System activators via a fluorescence-based single-stranded RNase assay
EC50>99000±n/a nM
Citation PubChem, PC Dose response confirmation uHTS hits for MazEF TA System activators via a fluorescence-based single-stranded RNase assay PubChem Bioassay(2011)[AID]
 
Endoribonuclease toxin MazF
Name:Endoribonuclease toxin MazF
Type:Enzyme Catalytic Domain
Mol. Mass.:12100.43
Organism:Escherichia coli str. K-12 substr. MG1655
Description:gi_16130689
Residue:111
BDBM31009
NameBDBM31009
Synonyms:1-[3-[1-cyano-2-(cyclohexylamino)-2-keto-ethyl]quinoxalin-2-yl]isonipecotamide 1-[3-[1-cyano-2-(cyclohexylamino)-2-oxoethyl]-2-quinoxalinyl]-4-piperidinecarboxamide MLS000079941 cid_660662
TypeSmall organic molecule
Emp. Form.C23H28N6O2
Mol. Mass.420.5074
SMILESNC(=O)C1CCN(CC1)c1nc2ccccc2nc1C(C#N)C(=O)NC1CCCCC1