Reaction Details
TargetEndoribonuclease toxin MazF
LigandBDBM67581
Substrate/Competitorn/a
Meas. Tech.Dose response confirmation uHTS hits for MazEF TA System activators via a fluorescence-based single-stranded RNase assay
EC50 38000±n/a nM
Citation PubChem, PC Dose response confirmation uHTS hits for MazEF TA System activators via a fluorescence-based single-stranded RNase assay PubChem Bioassay(2011)[AID]
 
Endoribonuclease toxin MazF
Name:Endoribonuclease toxin MazF
Type:Enzyme Catalytic Domain
Mol. Mass.:12100.43
Organism:Escherichia coli str. K-12 substr. MG1655
Description:gi_16130689
Residue:111
BDBM67581
NameBDBM67581
Synonyms:MLS000050452 N-(5-chloro-2-hydroxy-phenyl)-2-ethoxy-benzamide SMR000076353 | cid_2953683
TypeSmall organic molecule
Emp. Form.C15H14ClNO3
Mol. Mass.291.73
SMILESCCOc1ccccc1C(=O)Nc1cc(Cl)ccc1O