Reaction Details
TargetEndoribonuclease toxin MazF
LigandBDBM83487
Substrate/Competitorn/a
Meas. Tech.Dose response confirmation uHTS hits for MazEF TA System activators via a fluorescence-based single-stranded RNase assay
EC50 18000±n/a nM
Citation PubChem, PC Dose response confirmation uHTS hits for MazEF TA System activators via a fluorescence-based single-stranded RNase assay PubChem Bioassay(2011)[AID]
 
Endoribonuclease toxin MazF
Name:Endoribonuclease toxin MazF
Type:Enzyme Catalytic Domain
Mol. Mass.:12100.43
Organism:Escherichia coli str. K-12 substr. MG1655
Description:gi_16130689
Residue:111
BDBM83487
NameBDBM83487
Synonyms:2-[[2-keto-2-(2-thienyl)ethyl]thio]-4,6-dimethyl-nicotinonitrile 4,6-dimethyl-2-(2-oxo-2-thiophen-2-ylethyl)sulfanylpyridine-3-carbonitrile MLS000105860 cid_685878
TypeSmall organic molecule
Emp. Form.C14H12N2OS2
Mol. Mass.288.388
SMILESCc1cc(C)c(C#N)c(SCC(=O)c2cccs2)n1