Reaction Details
TargetEndoribonuclease toxin MazF
LigandBDBM69390
Substrate/Competitorn/a
Meas. Tech.Dose response confirmation uHTS hits for MazEF TA System activators via a fluorescence-based single-stranded RNase assay
EC50>99000±n/a nM
Citation PubChem, PC Dose response confirmation uHTS hits for MazEF TA System activators via a fluorescence-based single-stranded RNase assay PubChem Bioassay(2011)[AID]
 
Endoribonuclease toxin MazF
Name:Endoribonuclease toxin MazF
Type:Enzyme Catalytic Domain
Mol. Mass.:12100.43
Organism:Escherichia coli str. K-12 substr. MG1655
Description:gi_16130689
Residue:111
BDBM69390
NameBDBM69390
Synonyms:2-(3,4-dihydroxyphenyl)-7-hydroxy-8-(3-methylbut-2-enyl)-2,3-dihydrochromen-4-one 2-(3,4-dihydroxyphenyl)-7-hydroxy-8-(3-methylbut-2-enyl)chroman-4-one MLS000876983 cid_16196974
TypeSmall organic molecule
Emp. Form.C20H20O5
Mol. Mass.340.3698
SMILES[#6]\[#6](-[#6])=[#6]\[#6]-c1c(-[#8])ccc2-[#6](=O)-[#6]-[#6](-[#8]-c12)-c1ccc(-[#8])c(-[#8])c1