Reaction Details
TargetEndoribonuclease toxin MazF
LigandBDBM83664
Substrate/Competitorn/a
Meas. Tech.Dose response confirmation uHTS hits for MazEF TA System activators via a fluorescence-based single-stranded RNase assay
EC50 9430±n/a nM
Citation PubChem, PC Dose response confirmation uHTS hits for MazEF TA System activators via a fluorescence-based single-stranded RNase assay PubChem Bioassay(2011)[AID]
 
Endoribonuclease toxin MazF
Name:Endoribonuclease toxin MazF
Type:Enzyme Catalytic Domain
Mol. Mass.:12100.43
Organism:Escherichia coli str. K-12 substr. MG1655
Description:gi_16130689
Residue:111
BDBM83664
NameBDBM83664
Synonyms:4-[[(2-keto-1,3,3-trimethyl-indolin-5-yl)sulfonylamino]methyl]-N-[(5-methyl-2-furyl)methyl]benzamide N-[(5-methyl-2-furanyl)methyl]-4-[[(1,3,3-trimethyl-2-oxo-5-indolyl)sulfonylamino]methyl]benzamide N-[(5-methylfuran-2-yl)methyl]-4-[[(1,3,3-trimethyl-2-oxoindol-5-yl)sulfonylamino]methyl]benzamide cid_20903324
TypeSmall organic molecule
Emp. Form.C25H27N3O5S
Mol. Mass.481.564
SMILESCN1C(=O)C(C)(C)c2cc(ccc12)S(=O)(=O)NCc1ccc(cc1)C(=O)NCc1ccc(C)o1