Reaction Details
TargetEndoribonuclease toxin MazF
LigandBDBM83476
Substrate/Competitorn/a
Meas. Tech.Dose response confirmation uHTS hits for MazEF TA System activators via a fluorescence-based single-stranded RNase assay counterscreen
EC50>99000±n/a nM
Citation PubChem, PC Dose response confirmation uHTS hits for MazEF TA System activators via a fluorescence-based single-stranded RNase assay counterscreen PubChem Bioassay(2011)[AID]
 
Endoribonuclease toxin MazF
Name:Endoribonuclease toxin MazF
Type:Enzyme Catalytic Domain
Mol. Mass.:12100.43
Organism:Escherichia coli str. K-12 substr. MG1655
Description:gi_16130689
Residue:111
BDBM83476
NameBDBM83476
Synonyms:(2-oxidanylidene-1H-quinolin-3-yl)methyl 3-methylbenzoate 3-methylbenzoic acid (2-keto-1H-quinolin-3-yl)methyl ester MLS000081238 cid_663555
TypeSmall organic molecule
Emp. Form.C18H15NO3
Mol. Mass.293.3166
SMILESCc1cccc(c1)C(=O)OCc1cc2ccccc2[nH]c1=O