Reaction Details
TargetEndoribonuclease toxin MazF
LigandBDBM47567
Substrate/Competitorn/a
Meas. Tech.Dose response confirmation uHTS hits for MazEF TA System activators via a fluorescence-based single-stranded RNase assay counterscreen
EC50 10600±n/a nM
Citation PubChem, PC Dose response confirmation uHTS hits for MazEF TA System activators via a fluorescence-based single-stranded RNase assay counterscreen PubChem Bioassay(2011)[AID]
 
Endoribonuclease toxin MazF
Name:Endoribonuclease toxin MazF
Type:Enzyme Catalytic Domain
Mol. Mass.:12100.43
Organism:Escherichia coli str. K-12 substr. MG1655
Description:gi_16130689
Residue:111
BDBM47567
NameBDBM47567
Synonyms:MLS000533951 [3-amino-6-(2-thienyl)-4-(trifluoromethyl)thieno[2,3-b]pyridin-2-yl](cyclopropyl)methanone [3-amino-6-thiophen-2-yl-4-(trifluoromethyl)-2-thieno[2,3-b]pyridinyl]-cyclopropylmethanone [3-azanyl-6-thiophen-2-yl-4-(trifluoromethyl)thieno[2,3-b]pyridin-2-yl]-cyclopropyl-methanone | cid_1039936
TypeSmall organic molecule
Emp. Form.C16H11F3N2OS2
Mol. Mass.368.397
SMILESNc1c(sc2nc(cc(c12)C(F)(F)F)-c1cccs1)C(=O)C1CC1