Reaction Details
TargetEndoribonuclease toxin MazF
LigandBDBM83618
Substrate/Competitorn/a
Meas. Tech.Dose response confirmation uHTS hits for MazEF TA System activators via a fluorescence-based single-stranded RNase assay counterscreen
EC50 7910±n/a nM
Citation PubChem, PC Dose response confirmation uHTS hits for MazEF TA System activators via a fluorescence-based single-stranded RNase assay counterscreen PubChem Bioassay(2011)[AID]
 
Endoribonuclease toxin MazF
Name:Endoribonuclease toxin MazF
Type:Enzyme Catalytic Domain
Mol. Mass.:12100.43
Organism:Escherichia coli str. K-12 substr. MG1655
Description:gi_16130689
Residue:111
BDBM83618
NameBDBM83618
Synonyms:4-methyl-N-(1-methylpropylideneamino)-3-nitro-benzenesulfonamide N-(butan-2-ylideneamino)-4-methyl-3-nitro-benzenesulfonamide SMR000370481 | cid_3910353
TypeSmall organic molecule
Emp. Form.C11H15N3O4S
Mol. Mass.285.32
SMILESCC[C+](C)[N-]NS(=O)(=O)c1ccc(C)c(c1)[N+]([O-])=O