Reaction Details
TargetApoptotic protease-activating factor 1
LigandBDBM40322
Substrate/Competitorn/a
Meas. Tech.Dose response confirmation of uHTS hits for Apaf-1 in a Fluorescent assay
IC50 4020±n/a nM
Citation PubChem, PC Dose response confirmation of uHTS hits for Apaf-1 in a Fluorescent assay PubChem Bioassay(2011)[AID]
 
Apoptotic protease-activating factor 1
Name:Apoptotic protease-activating factor 1
Type:Enzyme Catalytic Domain
Mol. Mass.:141834.40
Organism:Homo sapiens (Human)
Description:O14727
Residue:1248
BDBM40322
NameBDBM40322
Synonyms:2-(1-benzotriazolyl)-3-(4-morpholinyl)naphthalene-1,4-dione 2-(benzotriazol-1-yl)-3-morpholin-4-ylnaphthalene-1,4-dione 2-Benzotriazol-1-yl-3-morpholin-4-yl-[1,4]naphthoquinone SMR000147150 | cid_1405137
TypeSmall organic molecule
Emp. Form.C20H16N4O3
Mol. Mass.360.366
SMILESO=C1C(N2CCOCC2)=C(C(=O)c2ccccc12)n1nnc2ccccc12