Reaction Details
TargetApoptotic protease-activating factor 1
LigandBDBM34745
Substrate/Competitorn/a
Meas. Tech.Dose response confirmation of uHTS hits for Apaf-1 in a Fluorescent assay
IC50 2560±n/a nM
Citation PubChem, PC Dose response confirmation of uHTS hits for Apaf-1 in a Fluorescent assay PubChem Bioassay(2011)[AID]
 
Apoptotic protease-activating factor 1
Name:Apoptotic protease-activating factor 1
Type:Enzyme Catalytic Domain
Mol. Mass.:141834.40
Organism:Homo sapiens (Human)
Description:O14727
Residue:1248
BDBM34745
NameBDBM34745
Synonyms:(4Z)-4-[[2-(2,6-dipyrrolidin-1-ylpyrimidin-4-yl)hydrazinyl]methylidene]-2-hydroxycyclohexa-2,5-dien-1-one (4Z)-4-[[N'-(2,6-dipyrrolidinopyrimidin-4-yl)hydrazino]methylene]-2-hydroxy-cyclohexa-2,5-dien-1-one 4-[(2,6-Di-pyrrolidin-1-yl-pyrimidin-4-yl)-hydrazonomethyl]-benzene-1,2-diol SMR000172266 | cid_5340492
TypeSmall organic molecule
Emp. Form.C19H24N6O2
Mol. Mass.368.4329
SMILESOc1ccc(CN=Nc2cc(nc(n2)N2CCCC2)N2CCCC2)cc1O