Reaction Details
TargetApoptotic protease-activating factor 1
LigandBDBM34768
Substrate/Competitorn/a
Meas. Tech.Dose response confirmation of uHTS hits for Apaf-1 in a Fluorescent assay
IC50 2360±n/a nM
Citation PubChem, PC Dose response confirmation of uHTS hits for Apaf-1 in a Fluorescent assay PubChem Bioassay(2011)[AID]
 
Apoptotic protease-activating factor 1
Name:Apoptotic protease-activating factor 1
Type:Enzyme Catalytic Domain
Mol. Mass.:141834.40
Organism:Homo sapiens (Human)
Description:O14727
Residue:1248
BDBM34768
NameBDBM34768
Synonyms:6-N-[(4-methoxyphenyl)methylideneamino]-2-N,2-N,4-N,4-N-tetramethylpyrimidine-2,4,6-triamine MLS000566872 N6-[(4-methoxyphenyl)methylideneamino]-N2,N2,N4,N4-tetramethylpyrimidine-2,4,6-triamine [2-(dimethylamino)-6-(N'-p-anisylidenehydrazino)pyrimidin-4-yl]-dimethyl-amine | cid_2850301
TypeSmall organic molecule
Emp. Form.C16H22N6O
Mol. Mass.314.3855
SMILESCOc1ccc(CN=Nc2cc(nc(n2)N(C)C)N(C)C)cc1