Reaction Details
TargetApoptotic protease-activating factor 1
LigandBDBM34893
Substrate/Competitorn/a
Meas. Tech.Dose response confirmation of uHTS hits for Apaf-1 in a Fluorescent assay
IC50 1100±n/a nM
Citation PubChem, PC Dose response confirmation of uHTS hits for Apaf-1 in a Fluorescent assay PubChem Bioassay(2011)[AID]
 
Apoptotic protease-activating factor 1
Name:Apoptotic protease-activating factor 1
Type:Enzyme Catalytic Domain
Mol. Mass.:141834.40
Organism:Homo sapiens (Human)
Description:O14727
Residue:1248
BDBM34893
NameBDBM34893
Synonyms:6-N-(benzylideneamino)-2-N,2-N,4-N,4-N-tetramethylpyrimidine-2,4,6-triamine N2,N2,N4,N4-tetramethyl-N6-[(phenylmethylene)amino]pyrimidine-2,4,6-triamine SMR000282965 [4-[(N''Z)-N''-benzalhydrazino]-6-(dimethylamino)pyrimidin-2-yl]-dimethyl-amine cid_2853497
TypeSmall organic molecule
Emp. Form.C15H20N6
Mol. Mass.284.3595
SMILESCN(C)c1cc(N=NCc2ccccc2)nc(n1)N(C)C