Reaction Details
TargetApoptotic protease-activating factor 1
LigandBDBM71037
Substrate/Competitorn/a
Meas. Tech.Dose response confirmation of uHTS hits for Apaf-1 in a Fluorescent assay
IC50 13900±n/a nM
Citation PubChem, PC Dose response confirmation of uHTS hits for Apaf-1 in a Fluorescent assay PubChem Bioassay(2011)[AID]
 
Apoptotic protease-activating factor 1
Name:Apoptotic protease-activating factor 1
Type:Enzyme Catalytic Domain
Mol. Mass.:141834.40
Organism:Homo sapiens (Human)
Description:O14727
Residue:1248
BDBM71037
NameBDBM71037
Synonyms:2-methyl-3-(morpholine-4-carbonyl)benzo[f][1]benzofuran-4,9-dione 2-methyl-3-[4-morpholinyl(oxo)methyl]benzo[f]benzofuran-4,9-dione MLS000419486 cid_1382504
TypeSmall organic molecule
Emp. Form.C18H15NO5
Mol. Mass.325.3154
SMILESCc1oc2c(c1C(=O)N1CCOCC1)C(=O)c1ccccc1C2=O