Reaction Details
TargetApoptotic protease-activating factor 1
LigandBDBM71178
Substrate/Competitorn/a
Meas. Tech.Dose response confirmation of uHTS hits for Apaf-1 in a Fluorescent assay
IC50 7800±n/a nM
Citation PubChem, PC Dose response confirmation of uHTS hits for Apaf-1 in a Fluorescent assay PubChem Bioassay(2011)[AID]
 
Apoptotic protease-activating factor 1
Name:Apoptotic protease-activating factor 1
Type:Enzyme Catalytic Domain
Mol. Mass.:141834.40
Organism:Homo sapiens (Human)
Description:O14727
Residue:1248
BDBM71178
NameBDBM71178
Synonyms:4-(3-Benzotriazol-1-yl-1,4-dioxo-1,4-dihydro-naphthalen-2-ylamino)-benzoic acid 4-[[3-(benzotriazol-1-yl)-1,4-bis(oxidanylidene)naphthalen-2-yl]amino]benzoic acid 4-[[3-(benzotriazol-1-yl)-1,4-dioxonaphthalen-2-yl]amino]benzoic acid SMR000415241 | cid_1397082
TypeSmall organic molecule
Emp. Form.C23H14N4O4
Mol. Mass.410.3817
SMILESOC(=O)c1ccc(NC2=C(C(=O)c3ccccc3C2=O)n2nnc3ccccc23)cc1