Reaction Details
TargetApoptotic protease-activating factor 1
LigandBDBM75309
Substrate/Competitorn/a
Meas. Tech.Dose response confirmation of uHTS hits for Apaf-1 in a Fluorescent assay
IC50 20800±n/a nM
Citation PubChem, PC Dose response confirmation of uHTS hits for Apaf-1 in a Fluorescent assay PubChem Bioassay(2011)[AID]
 
Apoptotic protease-activating factor 1
Name:Apoptotic protease-activating factor 1
Type:Enzyme Catalytic Domain
Mol. Mass.:141834.40
Organism:Homo sapiens (Human)
Description:O14727
Residue:1248
BDBM75309
NameBDBM75309
Synonyms:(2Z)-3-ethyl-2-[(E)-3-(3-ethyl-1,3-benzothiazol-3-ium-2-yl)prop-2-enylidene]-1,3-benzothiazole;iodide MLS001032120 cid_5709759
TypeSmall organic molecule
Emp. Form.C21H21N2S2
Mol. Mass.365.534
SMILESCCN1\C(Sc2ccccc12)=C\C=C\c1sc2ccccc2[n+]1CC