Reaction Details
TargetApoptotic protease-activating factor 1
LigandBDBM59083
Substrate/Competitorn/a
Meas. Tech.Dose response confirmation of uHTS hits for Apaf-1 in a Fluorescent assay
IC50 8370±n/a nM
Citation PubChem, PC Dose response confirmation of uHTS hits for Apaf-1 in a Fluorescent assay PubChem Bioassay(2011)[AID]
 
Apoptotic protease-activating factor 1
Name:Apoptotic protease-activating factor 1
Type:Enzyme Catalytic Domain
Mol. Mass.:141834.40
Organism:Homo sapiens (Human)
Description:O14727
Residue:1248
BDBM59083
NameBDBM59083
Synonyms:MLS002154065 THONZONIUM BROMIDE cid_11102
TypeSmall organic molecule
Emp. Form.C32H55N4O
Mol. Mass.511.8048
[N+](C)(C)CCN(Cc1ccc(OC)cc1)c1ncccn1