Reaction Details
TargetApoptotic protease-activating factor 1
LigandBDBM71232
Substrate/Competitorn/a
Meas. Tech.Dose Response validation of Inhibitors of Apaf-1 using a Fluorescent Interference Counterscreen assay
IC50>100000±0 nM
Citation PubChem, PC Dose Response validation of Inhibitors of Apaf-1 using a Fluorescent Interference Counterscreen assay PubChem Bioassay(2011)[AID]
 
Apoptotic protease-activating factor 1
Name:Apoptotic protease-activating factor 1
Type:Enzyme Catalytic Domain
Mol. Mass.:141834.40
Organism:Homo sapiens (Human)
Description:O14727
Residue:1248
BDBM71232
NameBDBM71232
Synonyms:3-(3-Benzotriazol-1-yl-1,4-dioxo-1,4-dihydro-naphthalen-2-ylamino)-benzoic acid 3-[[3-(benzotriazol-1-yl)-1,4-bis(oxidanylidene)naphthalen-2-yl]amino]benzoic acid 3-[[3-(benzotriazol-1-yl)-1,4-dioxonaphthalen-2-yl]amino]benzoic acid SMR000414332 | cid_1045968
TypeSmall organic molecule
Emp. Form.C23H14N4O4
Mol. Mass.410.3817
SMILESOC(=O)c1cccc(NC2=C(C(=O)c3ccccc3C2=O)n2nnc3ccccc23)c1