Reaction Details
TargetApoptotic protease-activating factor 1
LigandBDBM48030
Substrate/Competitorn/a
Meas. Tech.Dose Response validation of Inhibitors of Apaf-1 using a Fluorescent Interference Counterscreen assay
IC50>100000±0 nM
Citation PubChem, PC Dose Response validation of Inhibitors of Apaf-1 using a Fluorescent Interference Counterscreen assay PubChem Bioassay(2011)[AID]
 
Apoptotic protease-activating factor 1
Name:Apoptotic protease-activating factor 1
Type:Enzyme Catalytic Domain
Mol. Mass.:141834.40
Organism:Homo sapiens (Human)
Description:O14727
Residue:1248
BDBM48030
NameBDBM48030
Synonyms:4-[(E)-[3-(2-fluoroanilino)-4-keto-1-naphthylidene]amino]sulfonylbenzoic acid 4-[(E)-[3-(2-fluoroanilino)-4-oxonaphthalen-1-ylidene]amino]sulfonylbenzoic acid MLS000948172 cid_6023694
TypeSmall organic molecule
Emp. Form.C23H15FN2O5S
Mol. Mass.450.439
SMILESOC(=O)c1ccc(cc1)S(=O)(=O)N=C1C=C(Nc2ccccc2F)C(=O)c2ccccc12