Reaction Details
TargetCaspase-9
LigandBDBM39886
Substrate/Competitorn/a
Meas. Tech.Dose response confirmation of uHTS hits for Apaf-1 using a LZ-Caspase-9/Caspase-3 Fluorescent Selectivity assay
IC50 19800±n/a nM
Citation PubChem, PC Dose response confirmation of uHTS hits for Apaf-1 using a LZ-Caspase-9/Caspase-3 Fluorescent Selectivity assay PubChem Bioassay(2011)[AID]
 
Caspase-9
Name:Caspase-9
Type:Enzyme
Mol. Mass.:46277.29
Organism:Homo sapiens (Human)
Description:n/a
Residue:416
BDBM39886
NameBDBM39886
Synonyms:4b,9b-bis(oxidanyl)-7,8-dihydro-6H-indeno[1,2-b][1]benzofuran-9,10-dione 4b,9b-dihydroxy-7,8-dihydro-6H-indeno[1,2-b]benzofuran-9,10-dione MLS000104338 cid_2834991
TypeSmall organic molecule
Emp. Form.C15H12O5
Mol. Mass.272.2528
SMILESOC12OC3=C(C(=O)CCC3)C1(O)C(=O)c1ccccc21