Reaction Details
TargetCaspase-9
LigandBDBM43224
Substrate/Competitorn/a
Meas. Tech.Dose response confirmation of uHTS hits for Apaf-1 using a LZ-Caspase-9/Caspase-3 Fluorescent Selectivity assay
IC50 51.9±n/a nM
Citation PubChem, PC Dose response confirmation of uHTS hits for Apaf-1 using a LZ-Caspase-9/Caspase-3 Fluorescent Selectivity assay PubChem Bioassay(2011)[AID]
 
Caspase-9
Name:Caspase-9
Type:Enzyme
Mol. Mass.:46277.29
Organism:Homo sapiens (Human)
Description:n/a
Residue:416
BDBM43224
NameBDBM43224
Synonyms:1-ethyl-6-methyl-3-[(E)-2-phenylethenyl]pyrimido[5,4-e][1,2,4]triazine-5,7-dione MLS000717146 US9073941, 609 | cid_5756371
TypeSmall organic molecule
Emp. Form.C16H15N5O2
Mol. Mass.309.3226
SMILESCCn1nc(\C=C\c2ccccc2)nc2c1nc(=O)n(C)c2=O