Reaction Details
TargetCaspase-9
LigandBDBM71178
Substrate/Competitorn/a
Meas. Tech.Dose response confirmation of uHTS hits for Apaf-1 using a LZ-Caspase-9/Caspase-3 Fluorescent Selectivity assay
IC50 7250±n/a nM
Citation PubChem, PC Dose response confirmation of uHTS hits for Apaf-1 using a LZ-Caspase-9/Caspase-3 Fluorescent Selectivity assay PubChem Bioassay(2011)[AID]
 
Caspase-9
Name:Caspase-9
Type:Enzyme
Mol. Mass.:46277.29
Organism:Homo sapiens (Human)
Description:n/a
Residue:416
BDBM71178
NameBDBM71178
Synonyms:4-(3-Benzotriazol-1-yl-1,4-dioxo-1,4-dihydro-naphthalen-2-ylamino)-benzoic acid 4-[[3-(benzotriazol-1-yl)-1,4-bis(oxidanylidene)naphthalen-2-yl]amino]benzoic acid 4-[[3-(benzotriazol-1-yl)-1,4-dioxonaphthalen-2-yl]amino]benzoic acid SMR000415241 | cid_1397082
TypeSmall organic molecule
Emp. Form.C23H14N4O4
Mol. Mass.410.3817
SMILESOC(=O)c1ccc(NC2=C(C(=O)c3ccccc3C2=O)n2nnc3ccccc23)cc1