Reaction Details
TargetCaspase-9
LigandBDBM79255
Substrate/Competitorn/a
Meas. Tech.Dose response confirmation of uHTS hits for Apaf-1 using a LZ-Caspase-9/Caspase-3 Fluorescent Selectivity assay
IC50>100000±n/a nM
Citation PubChem, PC Dose response confirmation of uHTS hits for Apaf-1 using a LZ-Caspase-9/Caspase-3 Fluorescent Selectivity assay PubChem Bioassay(2011)[AID]
 
Caspase-9
Name:Caspase-9
Type:Enzyme
Mol. Mass.:46277.29
Organism:Homo sapiens (Human)
Description:n/a
Residue:416
BDBM79255
NameBDBM79255
Synonyms:MLS002153690 SMR001231068 | cid_25162995
TypeSmall organic molecule
Emp. Form.C64H112N20O7
Mol. Mass.1273.7039
SMILES[#6]-[#6]-[#6@H](-[#6])-[#6@@H](-[#6](=O)-[#7]-[#6]-[#6]-[#6]-[#6]-[#6]-[#6]-[#6]-[#6]-[#6]-[#6]-[#6](=O)-[#7]-1-[#6]-[#6]-[#7](-[#6]-[#6]-1)-c1nc(-[#7]-[#6]-[#6]-[#8]-[#6]-[#6]-[#8]-[#6]-[#6]-[#8]-[#6]C#C)nc(n1)-[#7]-1-[#6]-[#6]-[#7](-[#6]-[#6]-1)-[#6](=O)-[#6]-[#6]-[#6]-[#6]-[#6]-[#6]-[#6]-[#6]-[#6]-[#6]-[#7]-[#6](=O)-[#6@H](-[#6]-[#6]-[#6]-[#6]-[#7])-n1cc(-[#6])nn1)-n1cc(-[#6]-[#6]-[#6]-[#6]\[#7]=[#6](\[#7])-[#7])nn1