Reaction Details
TargetApoptotic protease-activating factor 1
LigandBDBM30719
Substrate/Competitorn/a
Meas. Tech.Dose Response validation of Activators of Apaf-1 using a Fluorescent Interference Counterscreen assay
EC50>100000±0 nM
Citation PubChem, PC Dose Response validation of Activators of Apaf-1 using a Fluorescent Interference Counterscreen assay PubChem Bioassay(2011)[AID]
 
Apoptotic protease-activating factor 1
Name:Apoptotic protease-activating factor 1
Type:Enzyme Catalytic Domain
Mol. Mass.:141834.40
Organism:Homo sapiens (Human)
Description:O14727
Residue:1248
BDBM30719
NameBDBM30719
Synonyms:(3E)-6-hexyl-3-[(5E)-5-(6-ketocyclohexa-2,4-dien-1-ylidene)-1,3,4-oxadiazolidin-2-ylidene]chromene-2,7-quinone (3E)-6-hexyl-3-[(5E)-5-(6-oxo-1-cyclohexa-2,4-dienylidene)-1,3,4-oxadiazolidin-2-ylidene]-1-benzopyran-2,7-dione MLS000079474 cid_5389090
TypeSmall organic molecule
Emp. Form.C23H22N2O5
Mol. Mass.406.4312
SMILESCCCCCCC1=Cc2c\c(=C3\NN\C(O3)=C3\C=CC=CC3=O)c(=O)oc2=CC1=O